Tag: compiler-errors

Ein Fehler, der erzeugt wird, während die Zusammenstellung phase, die oft durch Probleme mit Ungültiger syntax und/oder Arten. Vergleichen Sie auf [runtime error].

Fehler C2280: Versuch zum Verweis auf eine gelöschte Funktion

Anzahl der Antworten 3 Antworten
Ich bin neu in der Spieleentwicklung und sehr neu in c++, aber ich habe begonnen, ein kleines Arkanoid Spiel. Ich habe es zuvor ausgeführt, aber nach dem refactoring (Einführung in die ArkanoidGame Klasse) es ist nicht kompilieren

Fehler: expected unqualified-id-Fehler: Bedeutung und beheben?

Anzahl der Antworten 1 Antworten
Ich bin nur zu lernen, C++, kommen aus der Python ist3 und QBASIC, und bin eine sehr harte Zeit mit dem Lesen der compiler-Fehler und verstehen, wodurch es schwierig zu Debuggen. Das problem, das ich habe ist,

fatal error: libxml/xmlmemory.h: No such file or directory

Anzahl der Antworten 1 Antworten
Kann jemand mir erklären, dass Fehler und was muss ich tun, um es zu lösen !?: In file included from /home/jros/catkin_ws/src/kinectueye/include/MIXEDVISION/CModelStereoXml.h:6:0, from /home/jros/catkin_ws/src/kinectueye/src/kinect_ueye.cpp:10: /home/jros/catkin_ws/src/kinectueye/include/MIXEDVISION/CXml.h:6:31: fatal error: libxml/xmlmemory.h: No such file or directory compilation terminated. CModelStereoXml, CXml und

Visual Basic, End of-Anweisung Erwartet - Funktion

Anzahl der Antworten 4 Antworten
Ich habe Probleme versuchen zu beheben einem "Ende der Anweisung Erwartet" Fehler für dieses Programm, das ich gearbeitet habe. Alles andere scheint zu funktionieren gut, bis ich angefangen habe, arbeiten mit der Function-Anweisung, die ich rief Zahlungen.

Installieren & Kompilieren ZeroMQ/ZMQ/0MQ auf Ubuntu 12.04 32bit

Anzahl der Antworten 2 Antworten
Ich wirklich verwenden möchten 0MQ für ein persönliches Projekt, aber ich habe eine sehr harte Zeit getting things zu kompilieren, nach der installation Hier ist was ich tun: #### Installation der erforderlichen Komponenten, ohne Fehler: #### $

C++ - Kopie ein stream-Objekt

Anzahl der Antworten 5 Antworten
Ich habe experimentiert mit C++, und ich habe auf ein problem stoßen, dass ich nicht weiß, wie zu lösen. Im Grunde, habe ich entdeckt, dass Sie nicht kopieren können-streams (siehe Warum das kopieren von stringstream ist nicht

Wie zu verwenden Aufgabe.Ausführen(Aktion<T>)

Anzahl der Antworten 1 Antworten
Ich bin versucht, erstellen Sie eine Methode, die akzeptiert TcpClient-verbindungen und eine Aufgabe erfüllt, sobald ein client verbunden ist, "ConnectedAction". Ich bekomme einen kompilieren Fehler beim Versuch, eine neue Aufgabe erstellt und führt den Delegaten "ConnectedAction". Argument

Was dieser Fehler bedeutet" Ausdruck muss Zeiger-auf-Klasse-Typ"?

Anzahl der Antworten 1 Antworten
Ich bin ein Anfänger, ich Mache einen treap Baum , ich ein Klasse Typ und Zeiger auf diese class , wenn ich "this Stichwort" Punkt zum nächsten element dieser erschien compiler-Fehlermeldung: "Ausdruck muss Zeiger-auf-Klasse-Typ" this->right->search_el(k,p); InformationsquelleAutor Anoos

Maven-java-compile-Fehler-kann nicht auf CommonClassA

Anzahl der Antworten 3 Antworten
Hintergrund: Ich bin die Entwicklung von Maven multi-Modul-Projekt. Eine des das Modul ist ein gemeinsames Modul benötigt, alle anderen Module. Diesem Modul enthalten CommonClassA.java. gemeinsames Modul korrekt kompiliert wird. In die es installiert wird maven lokalen repository

Compile-error - Invalid types 'char[int]' for array subscript

Anzahl der Antworten 2 Antworten
Ich arbeite an einem Programm, das einige matrix-math. Glücklicherweise ist die code-Logik ist nicht das, was ist, dass Sie mir die Fehler. Ich bin mit dem folgenden code für die Ausgabe einer matrix, gespeichert in einem 2-d

Error C2100 - Illegal Indirection

Anzahl der Antworten 2 Antworten
Habe ich ein sehr einfaches Programm geschrieben, um zu definieren, ein operator * in ein array template-Klasse. Wenn ich versuche zu kompilieren, es gibt mir eine Fehlermeldung "illegal indirection". Jede Hilfe in der Angelegenheit würde sehr geschätzt

Struct struct innen

Anzahl der Antworten 4 Antworten
Ich muss eine Person und jede Person sollte einen Kühlschrank. Ist dies der beste Weg, es zu tun? Wenn ja, was mache ich falsch? Vielen Dank im Voraus. typedef struct { int age; struct FRIDGE fridge; }

Kann nicht geöffnet Includedatei: 'd3dx9.h': No such file or directory

Anzahl der Antworten 1 Antworten
Befor posting lese ich [Kann nicht geöffnet werden include-Datei "d3dx9.h" ] und [ Kann nicht geöffnet werden include-Datei "d3dx9.h" ], Aber keiner war. Meine Kompilieren-Fehler: Kann nicht geöffnet Includedatei: 'd3dx9.h': No such file or directory Ich habe

Python-Fehler: lokale variable verwiesen wird, bevor die Zuweisung

Anzahl der Antworten 2 Antworten
Hier ist mein code: import time GLO = time.time() def Test(): print GLO temp = time.time(); print temp GLO = temp Test() Traceback (most recent call last): File "test.py", line 11, in Test() File "test.py" line 6

Nicht einen Wert zurückgeben von der Methode, deren Ergebnistyp void Fehler

Anzahl der Antworten 2 Antworten
Ich bin versucht, den user-input von einer Methode, und verwenden Sie es in einem anderen. Ich bin verwirrt über die nicht einen Wert zurückgeben von der Methode, deren Ergebnistyp void error, weil "userMove" ist definiert als Typ

Verwenden Sie C-Funktion in C++ - Programms; "multiply-defined" - Fehler

Anzahl der Antworten 3 Antworten
Ich versuche, mit dieser code für das Porter-stemming-Algorithmus in einem C++ - Programm habe ich bereits geschrieben. Ich folgte den Anweisungen in der Nähe des Ende der Datei mit dem code, als separates Modul. Ich habe eine

Error CS0117: Namespace.Eine enthält keine definition für das Interface

Anzahl der Antworten 1 Antworten
Ich bin immer der Fehler: '- Namespace.Ein " enthält keine definition für 'MyObjectInterface' und keine Erweiterungsmethode 'MyObjectInterface' die Annahme ein erstes argument vom Typ ... Habe ich mir angeschaut diese und diese und weder scheint zu gelten.

Kann nicht finden das symbol

Anzahl der Antworten 4 Antworten
Ich bin immer der folgende java-compiler-Fehler: main.java:9: cannot find symbol symbol : method parseInt(int) location: class java.lang.Integer int count = Integer.parseInt(getPennies()); ^ main.java:23: incompatible types found : java.lang.String required: int JOptionPane.showInputDialog("How many pennies do you have?"); ^

Problem in C#: Bezeichner erwartet

Anzahl der Antworten 1 Antworten
Ich bin neu in C# zu Programmieren und ich habe code, ist, nehmen Sie in die Zwischenablage kopieren Sie die URL-Quelle der Dateien, die heruntergeladen werden. Aber es ist ein Fehler, es heißt "Bezeichner erwartet". Unten ist

C++ - es ist (war) nicht deklariert ist, in diesem Umfang

Anzahl der Antworten 1 Antworten
Ich bin üben meine C++ - coding-einfache Eingabe - /Ausgabe-Nutzers. Ich habe nun schon die Suche über eine Stunde auf gewusst wie: konvertieren einer Zeichenfolge in einen int. Jede Antwort ist anders, und erfordern etwas anderes. Ich

Eclipse Unresolved compilation

Anzahl der Antworten 3 Antworten
Habe ich in diesem wirklich seltsam problem, die Arbeit an einem grösseren Projekt in Eclipse Indigo 3.7.2. Ich habe das Projekt aus einem SVN-repository mit dem Subclipse-plug-in und wenn ich die Anwendung starten bekomme ich folgende Fehlermeldung:

error: invalid conversion from 'const char*' in 'int' [-fpermissive]

Anzahl der Antworten 1 Antworten
Arbeite ich an einem Projekt mit meinem arduino, die einen knock-knock-Witz auf einem LCD, aber ich lief in ein problem beim Programmieren. Dies ist, was ich bisher #include<LiquidCrystal.h> LiquidCrystal lcd(12,11,5,4,3,2); int buttonPin = 13; int menu =

Bezeichner erwartet error (Java)

Anzahl der Antworten 3 Antworten
Ich bin neu in der Programmierung und könnte eine helfende hand. Ich habe eine "Person" Klasse und eine TestPerson-Datei, um es zu testen (ja, das ist eine Zuweisung.) Bin ich immer drei Fehler "Bezeichner erwartet" auf Zeilen

Warum bekomme ich "Fehler: erwartet '=', ',', ';', 'asm' or '__attribute__' before 'int'" ?

Anzahl der Antworten 2 Antworten
processpairs2.c:7: error: expected '=', ',', ';', 'asm' oder 'Attribut' before 'int' Ist die Fehlermeldung bekomme ich immer wenn ich meine Datei kompilieren, die Fehlermeldung verweist mich auf Linie 7, die ist, wo ich erkläre die main() Funktion.

Fortran 90 kompilieren Ausgabe: undefined reference to <modulename>

Anzahl der Antworten 1 Antworten
Ich habe Probleme versuchen zu kompilieren eines einfachen fortran-Programm, das verwendet ein Modul in das gleiche Verzeichnis. Ich habe 2 Dateien: test1.f90, die das Programm enthält, und modtest.f90, die das Modul enthält. Dies ist test1.f90: program test

Fehler: ungültige Operanden der Typen "float" und "float" to binary 'operator%'

Anzahl der Antworten 3 Antworten
Ich habe gerade angefangen zu Programmieren in C, und ich fand ein problem, wenn das Programm läuft. Die Fehlermeldung ist folgende,resto == a % b; [Fehler] ungültige Operanden der Typen "float" und "float" to binary 'operator%' in

Konvertieren von dezimal zu Binär in Java

Anzahl der Antworten 9 Antworten
Bin ich zu schreiben versucht, einen code, wandelt eine Zahl in eine Binärzahl um, und das ist, was ich schrieb. Es gibt mir paar Fehler in Eclipse, welches ich nicht verstehe. Was ist falsch mit, dass? Irgendwelche

C "Erwartet Ausdruck" Fehler mit Xcode

Anzahl der Antworten 1 Antworten
Ich versuche, um diesen code zu kompilieren Beispiel aus dem Buch "Head First C" (Seite 50), und Xcode gibt mir die Fehlermeldung "Parse-Problem" "Erwartet Ausdruck" und markiert die Zeile "int longitude = -64;" in rot. #include <stdio.h>

Qt - 2 Fehler zur compile-Zeit

Anzahl der Antworten 4 Antworten
Ich habe gerade heruntergeladen Qt-SDK 4.8.1 und, nach der Installation, habe ich dann einfach versucht zu kompilieren eines Standard-C++ - Projekt, aber ich habe diesen seltsamen Fehler. 16:50:24: Ausführen von build-Schritte für Projekt testen... 16:50:24: Konfiguration unverändert,

Fehler CS1513: } erwartet asp.net mvc 4

Anzahl der Antworten 1 Antworten
Ich habe eine view, die ist sehr einfach. Es enthält einige C# - code. @{ ViewBag.Title = "Community"; Layout = "~/Views/Shared/_Layout.cshtml"; } <div id="req1"> <form> <input id="txt1" type="text" name="txt1" /> </form> </div> <div id="btn1">Send</div> <div id="res1"></div> @{

Fehler: keine übereinstimmung für die operator ==

Anzahl der Antworten 1 Antworten
Ich erhalte einen Fehler für mehrere Bereiche meiner drei Dateien. (Ich hab auch Probleme mit meiner Standard-Konstruktor, deshalb ist es auch auskommentiert. Aber ich möchte dieses problem lösen, erste) //ComputerType.h //************************************************************************ //This file gives the specification of

VBA: Speichern des Werts auf variable

Anzahl der Antworten 3 Antworten
Sub test() '' test Makro ' ' Dim aRange As Range Dim i As Integer Set aRange = Range("A1:A255") Range("A1").Select For i = 1 To aRange.Count - 1 If InStr(ActiveCell.Value, "Last name") Then Call CopyContents End If

gradle: Skipping Aufgabe ':compileJava' da es noch keine source Dateien

Anzahl der Antworten 1 Antworten
ich versuche gradle -d compileJava im mein Projekt versuchen, und gradle erhöhen "Skipping Aufgabe ':compileJava', da es keine source files.". das Schlimmste ist, dass ich nichts sehen kann erstellt in build/. ich dieses Projekt erstellen, nur mit

Warum bekomme ich einen Unreachable Statement Fehler in Java?

Anzahl der Antworten 5 Antworten
Wenn ich versuche zu kompilieren dieses Programm, bekomme ich ein "unreachable statement" Fehler in Zeile 21: import java.util.*; import java.io.*; import java.nio.file.*; import java.lang.StringBuilder; class FilePrep { public static void main(String args) { } public String getStringFromBuffer()

Fehler: expected '}' before 'else'?

Anzahl der Antworten 3 Antworten
Bekomme ich diese Fehler beim kompilieren meines Codes. experiment.cpp: In function ‘void convert(char*)’: experiment.cpp:47:5: error: expected ‘}’ before ‘else’ experiment.cpp:47:5: error: expected ‘}’ before ‘else’ experiment.cpp: At global scope: experiment.cpp:53:3: error: expected declaration before ‘}’ token Aber

Visual Studio, bonkers gegangen: "Der Verzeichnisname ist ungültig" Fehlermeldung, wenn Sie versuchen zu kompilieren

Anzahl der Antworten 3 Antworten
Für einige sehr seltsamen Grund, meine Visual Studio 2008, wenn Sie versuchen, zu kompilieren eines C# - Projekt, versucht zu schreiben der Ausgabe die ausführbare Datei in ein Verzeichnis mit dem gleichen Namen wie eine ausführbare Datei,

C++ explizite Typ fehlt('int' angenommen)

Anzahl der Antworten 2 Antworten
Hallo ich habe ein Fehler in meinem c++ - code. Ich habe 2 .cpp-Dateien und 1 .h-Datei, Im Versuch, Zugang 5 strings und 1 int in der header-Datei, aber ich bekomme eine Fehlermeldung, die sagt "expliziten Typ

Einrichten der Cloud9 IDE zum kompilieren und ausführen von Java?

Anzahl der Antworten 6 Antworten
Habe ich versucht, dieses posting Anfrage in der Cloud9-Foren, aber da es nie posts, ich hoffe jemand hier kann mir eine hand. (Das forum sagt immer, meine Frage wird zur überprüfung eingereicht, dann aber nie auftaucht). Ich

Das verknüpfen von Dateien, die in g++

Anzahl der Antworten 4 Antworten
Vor kurzem habe ich versucht zu kompilieren Sie ein Programm, in g++ (Ubuntu). Normalerweise verwende ich Dev-C++ (auf Windows) und es funktioniert dort so lange machen wie ich ein Projekt und legen Sie alle erforderlichen Dateien in

initializing argument 1 of... [-fpermissive]

Anzahl der Antworten 1 Antworten
Ich bin neu in c++ und mit eclipse cdt auf ubuntu installieren und diese Fehlermeldung bekommen in meiner header-Datei: initializing argument 1 of 'std::map<basic_string<char>,Supplier*> Engine::processSupplierFile(char*)' [-fpermissive] Ich schon gesucht für diesen Fehler und fand diese: Warum bin

libpthread.so.0: Fehler beim hinzufügen von Symbolen: DSO fehlt von der Kommandozeile aus

Anzahl der Antworten 11 Antworten
Wenn ich kompiliere openvswitch-1.5.0, ich habe festgestellt das folgende Kompilierungsfehler: gcc -Wstrict-prototypes -Wall -Wno-sign-compare -Wpointer-arith -Wdeclaration-after-statement -Wformat-security -Wswitch-enum -Wunused-parameter -Wstrict-aliasing -Wbad-function-cast -Wcast-align -Wstrict-prototypes -Wold-style-definition -Wmissing-prototypes -Wmissing-field-initializers -Wno-override-init -g -O2 -export-dynamic ***-lpthread*** -o utilities/ovs-dpctl utilities/ovs-dpctl.o lib/libopenvswitch.a /home/jyyoo/src/dpdk/build/lib/librte_eal.a /home/jyyoo/src/dpdk/build/lib/libethdev.a

Fehler in c-code: expected identifier or '(' before '{' token

Anzahl der Antworten 2 Antworten
Programm kurze übersicht (3-Körper-problem): #include <stdlib.h> #include <stdio.h> #include <math.h> double ax, ay, t; double dt; /* other declarations including file output, N and 6 command line arguments */ ... int main(int argc, char *argv) { int

Fehler in der Zuordnung der Mitglied im nur-Lesen-Objekt

Anzahl der Antworten 4 Antworten
Arbeite ich an worm_sim simulater , ubuntu, gcc, codeblocks IDE traffic_source.h-Datei class Traffic_source : public Buffer_owner, public Connector, public Addressee{ private: static unsigned int id_base; unsigned int id; unsigned int packet_size; unsigned int flit_size; double packet_generating_rate; int

C++ "erwartet, primary-expression before '(' token" - Fehler

Anzahl der Antworten 4 Antworten
Habe ich diesen code: FILE *f = fopen(intPath, "r"); Node *n; if (f) { try { n = parse(f, intPath); } catch (SyntaxError e) { fclose(f); /***** line 536 *****/ throw LangException( builtin_classes::exception_class::create_ImportError( String::fromAscii(e.filename)-> append(String::fromAscii(":"))-> append(String::fromInt(e.line))-> append(String::fromAscii(":"))->

FEHLER "cannot convert 'float' in 'float...'..."

Anzahl der Antworten 2 Antworten
Gibt es wahrscheinlich andere kleine Formatierungsfehler hier, die werde ich brauchen, um zu beheben, etc. was ich aber brauche Hilfe mit dem ist, was mit den folgenden: Lab8pt1.cpp: In function 'float Gehalt(float, float)': Lab8pt1.cpp:48: Fehler: Zuweisung der

Xcode 4.5: keine “com.apple.Produkt-Typ.Anwendung" " Produkt-Typ für iphoneos

Anzahl der Antworten 2 Antworten
Ich nur ein Upgrade von Xcode auf die version 4.5, aber bekomme ich jetzt diese Fehlermeldung, beim Versuch, führen Sie es auf meinem iPhone: target specifies product type 'com.apple.product-type.application', but there's no such product type for the

Excel-VBA: 'excel-vba-Laufzeitfehler 1004" application-defined or object-defined error

Anzahl der Antworten 2 Antworten
Habe ich diese Zeile in ein Modul und es hält spuckte einen Laufzeitfehler 1004, wenn ich versuche, und führen Sie es. Kann jemand helfen? Ich vermute, es ist zu tun, wie der Bereich verwiesen wird, bin mir

Java: Eingabe-Zeichenfolgen mit der Tastatur-Klasse

Anzahl der Antworten 5 Antworten
Ich versuche, die Eingabe von Informationen in der Java-Konsole-Anwendung, aber ich kann nicht scheinen, um es auszuführen. Dies ist, wie meine Java Datei sieht wie folgt aus: public class Ovning1_3 { public static void main(String args) {

C++ - Programmierung Fehler: expected unqualified-id before "{" token

Anzahl der Antworten 5 Antworten
Ich bin ein Neuling in C++, und ich bin versucht, ein "Rechner", die: addiert zwei zahlen subtrahiert zwei zahlen multipliziert zwei zahlen, zwei zahlen teilt, nimmt den Sinus von einer Zahl, nimmt der Cosinus einer Zahl, oder

Xcode zeigt viele Fehler, aber das Programm kompiliert und läuft einwandfrei (im simulator und Gerät)

Anzahl der Antworten 15 Antworten
Nach der Installation der CocoaLumberjack' log-Kompressor-Klasse, ich habe immer dieses lästige Verhalten: Xcode beschwert sich, dass es viele nicht deklarierte Bezeichner und gibt mir viele Fehler (keine Warnungen, aber Fehler mit dem roten Symbol). Der Sache ist,